Target
5-hydroxytryptamine receptor 1A
Ligand
BDBM50241143
Substrate
Ki
>10000±n/a nM
Comments
PDSP_1179
Citation
 Toll, LBerzetei-Gurske, IPPolgar, WEBrandt, SRAdapa, IDRodriguez, LSchwartz, RWHaggart, DO'Brien, AWhite, AKennedy, JMCraymer, KFarrington, LAuh, JS Standard binding and functional assays related to medications development division testing for potential cocaine and opiate narcotic treatment medications. NIDA Res Monogr 178:440-66 (1998) Target
Name:
5-hydroxytryptamine receptor 1A
Synonyms:
5-HT-1A 5-hydroxytryptamine receptor 1A (5-HT-1A) ADRB2RL1 Dopamine D2 receptor and serotonin 1a receptor HTR1A | Serotonin receptor 1A
Type:
Mol. Mass.:
46122.49
Organism:
Homo sapiens (Human)
Description:
Residue:
422
  
Inhibitor
Name:
BDBM50241143
Synonyms:
(MDL 72222)3,5-Dichloro-benzoic acid 8-methyl-8-aza-bicyclo[3.2.1]oct-3-yl ester 3,5-Dichloro-benzoic acid 8-methyl-8-aza-bicyclo[3.2.1]oct-3-yl ester (MDL 72222) 3,5-Dichloro-benzoic acid 8-methyl-8-aza-bicyclo[3.2.1]oct-3-yl ester(MDL-72222) 3alpha-(3',5'-dichlorobenzoyloxy)tropane MDL 72222 [2-(5-Hydroxy-1H-indol-3-yl)-ethyl]-trimethyl-ammonium
Type:
Small organic molecule
Emp. Form.:
C15H17Cl2NO2
Mol. Mass.:
314.207
SMILES:
CN1C2CCC1CC(C2)OC(=O)c1cc(Cl)cc(Cl)c1
: