Target
5-hydroxytryptamine receptor 2C
Ligand
BDBM4377
Substrate
Ki
>10000±n/a nM
Comments
PDSP_1062
Citation
 Toll, LBerzetei-Gurske, IPPolgar, WEBrandt, SRAdapa, IDRodriguez, LSchwartz, RWHaggart, DO'Brien, AWhite, AKennedy, JMCraymer, KFarrington, LAuh, JS Standard binding and functional assays related to medications development division testing for potential cocaine and opiate narcotic treatment medications. NIDA Res Monogr 178:440-66 (1998) Target
Name:
5-hydroxytryptamine receptor 2C
Synonyms:
5-HT2C 5-hydroxytryptamine receptor 2C (5HT2c) 5ht1c Htr2c Serotonin receptor 2a and 2c (5HT2A and 5HT2C)
Type:
Enzyme
Mol. Mass.:
51935.10
Organism:
Rattus norvegicus (Rat)
Description:
P08909
Residue:
460
  
Inhibitor
Name:
BDBM4377
Synonyms:
2-amino-3-(3,4-dihydroxyphenyl)propanoic acid L-DOPA
Type:
Small organic molecule
Emp. Form.:
C9H11NO4
Mol. Mass.:
197.1879
SMILES:
NC(Cc1ccc(O)c(O)c1)C(O)=O
: