Target
Somatostatin receptor type 4
Ligand
BDBM81766
Substrate
Ki
4949±n/a nM
Comments
PDSP_1242
Citation
 Yang, LBerk, SCRohrer, SPMosley, RTGuo, LUnderwood, DJArison, BHBirzin, ETHayes, ECMitra, SWParmar, RMCheng, KWu, TJButler, BSFoor, FPasternak, APan, YSilva, MFreidinger, RMSmith, RGChapman, KSchaeffer, JMPatchett, AA Synthesis and biological activities of potent peptidomimetics selective for somatostatin receptor subtype 2. Proc Natl Acad Sci U S A 95:10836-41 (1998)  
Target
Name:
Somatostatin receptor type 4
Synonyms:
SOMATOSTATIN SST4 SS4-R SSR4_HUMAN SSTR4 | Somatostatin receptor type 4 (SSTR4)
Type:
Enzyme
Mol. Mass.:
42015.38
Organism:
Homo sapiens (Human)
Description:
P31391
Residue:
388
  
Inhibitor
Name:
BDBM81766
Synonyms:
CAS_3086456 NSC_3086456
Type:
Small organic molecule
Emp. Form.:
C44H56N8O7
Mol. Mass.:
808.9648
SMILES:
CC(C)C1NC(=O)C(CCCCN)NC(=O)C(Cc2c[nH]c3ccccc23)NC(=O)C(Cc2ccc(O)cc2)NC(=O)C(C)N(C)C(=O)C(Cc2ccccc2)NC1=O
: