Target
Glutamate receptor ionotropic, NMDA 1
Ligand
BDBM50003659
Substrate
Ki
>10000±n/a nM
Comments
PDSP_469
Citation
 Snell, LDClaffey, DJRuth, JAValenzuela, CFCardoso, RWang, ZLevinson, SRSather, WAWilliamson, AVIngersoll, NCOvchinnikova, LBhave, SVHoffman, PLTabakoff, B Novel structure having antagonist actions at both the glycine site of the N-methyl-D-aspartate receptor and neuronal voltage-sensitive sodium channels: biochemical, electrophysiological, and behavioral characterization. J Pharmacol Exp Ther 292:215-27 (2000) Target
Name:
Glutamate receptor ionotropic, NMDA 1
Synonyms:
Glutamate (NMDA) receptor subunit zeta 1 Glutamate-NMDA-Channel Glutamate-NMDA-Polyamine NMDA Nmdar1 | phencyclidine
Type:
Enzyme Catalytic Domain
Mol. Mass.:
105533.40
Organism:
RAT
Description:
P35439
Residue:
938
  
Inhibitor
Name:
BDBM50003659
Synonyms:
5H-dibenzo[b,f]azepine-5-carboxamide CARBATROL DIBENZO[B,F]AZEPINE-5-CARBOXYLIC ACID AMIDE(CARBAMAZEPINE) EQUETRO TEGRETOL TERIL US9144538, Carbamazepine
Type:
Small organic molecule
Emp. Form.:
C15H12N2O
Mol. Mass.:
236.2686
SMILES:
NC(=O)N1c2ccccc2C=Cc2ccccc12
: