Target
Norepinephrine transporter
Ligand
BDBM50009057
Substrate
Ki
234±n/a nM
Comments
PDSP_7467
Citation
 Rothman, RBBaumann, MHDersch, CMRomero, DVRice, KCCarroll, FIPartilla, JS Amphetamine-type central nervous system stimulants release norepinephrine more potently than they release dopamine and serotonin. Synapse 39:32-41 (2001)  
Target
Name:
Norepinephrine transporter
Synonyms:
Type:
Enzyme Catalytic Domain
Mol. Mass.:
2082.45
Organism:
RAT
Description:
Norepinephrine transporter 0 RAT::Q9JIA2
Residue:
19
MLLARMKPQVQPELGGADQ
  
Inhibitor
Name:
BDBM50009057
Synonyms:
(R)Methyl-(1-methyl-2-phenyl-ethyl)-amine METHAMPHETAMINE (+) Methyl-(1-methyl-2-phenyl-ethyl)-amine | Methyl-(1-methyl-2-phenyl-ethyl)-amine(methamphetamine)
Type:
Small organic molecule
Emp. Form.:
C10H15N
Mol. Mass.:
149.2328
SMILES:
CNC(C)Cc1ccccc1
: