Target
Histamine H4 receptor
Ligand
BDBM50017656
Substrate
Ki
4184±n/a nM
Comments
PDSP_1476
Citation
 Nguyen, TShapiro, DAGeorge, SRSetola, VLee, DKCheng, RRauser, LLee, SPLynch, KRRoth, BLO'Dowd, BF Discovery of a novel member of the histamine receptor family. Mol Pharmacol 59:427-33 (2001)  
Target
Name:
Histamine H4 receptor
Synonyms:
AXOR35 GPCR105 HH4R HRH4 Histamine H4 receptor Histamine receptor (H3 and H4) SP9144
Type:
G Protein-Coupled Receptor (GPCR)
Mol. Mass.:
44517.02
Organism:
Homo sapiens (Human)
Description:
Binding assays were using CHO cells stably expressing hH4R receptors.
Residue:
390
  
Inhibitor
Name:
BDBM50017656
Synonyms:
CHEMBL1193 Naphcon-A PHENIRAMINE | Visine-A
Type:
Small organic molecule
Emp. Form.:
C16H20N2
Mol. Mass.:
240.3434
SMILES:
CN(C)CCC(c1ccccc1)c1ccccn1
: