Target
Bone morphogenetic protein receptor type-1A
Ligand
BDBM148348
Substrate
Meas. Tech.
Enzyme Assay
IC50
78.0±n/a nM
Citation
 Alimardanov, ACuny, GDGrewal, GSLee, AMcKew, JCMohedas, AHShen, MXu, XYu, PB BMP inhibitors and methods of use thereof US Patent  US10017516 Publication Date 7/10/2018 
Target
Name:
Bone morphogenetic protein receptor type-1A
Synonyms:
ACVRLK3 Activin receptor-like kinase 3 (ALK-3) BMR1A_HUMAN
Type:
Enzyme
Mol. Mass.:
60204.46
Organism:
Homo sapiens (Human)
Description:
P36894
Residue:
532
  
Inhibitor
Name:
BDBM148348
Synonyms:
US10017516, Compound 22 | US9682983, 22
Type:
Small organic molecule
Emp. Form.:
C26H22N6O2
Mol. Mass.:
450.4919
SMILES:
OC(=O)c1cccc2c(ccnc12)-c1cnn2cc(cnc12)-c1ccc(cc1)N1CCNCC1
: