Target
Sodium-dependent noradrenaline transporter
Ligand
BDBM50005246
Substrate
Ki
7.1±n/a nM
Comments
PDSP_296
Citation
 Rothman, RBVu, NPartilla, JSRoth, BLHufeisen, SJCompton-Toth, BABirkes, JYoung, RGlennon, RA In vitro characterization of ephedrine-related stereoisomers at biogenic amine transporters and the receptorome reveals selective actions as norepinephrine transporter substrates. J Pharmacol Exp Ther 307:138-45 (2003)  
Target
Name:
Sodium-dependent noradrenaline transporter
Synonyms:
Monoamine transporter NET Noradrenaline Transporter (NET) Norepinephrine transporter protein (NET) SLC6A2 Sodium-dependent noradrenaline transporter (NET) | Solute carrier family 6 member 2
Type:
Multi-pass membrane protein
Mol. Mass.:
69337.72
Organism:
Homo sapiens (Human)
Description:
P23975
Residue:
617
  
Inhibitor
Name:
BDBM50005246
Synonyms:
1-Phenylpropan-2-amin 1-phenylpropan-2-amine AMPHETAMINE Amfetamine DEXTROAMP SACCHARATE alpha-methylphenylethylamine beta-Phenylisopropylamin beta-phenylisopropylamine | desoxynorephedrine
Type:
Small organic molecule
Emp. Form.:
C9H13N
Mol. Mass.:
135.2062
SMILES:
CC(N)Cc1ccccc1
: