Target
Neuronal acetylcholine receptor subunit alpha-3
Ligand
BDBM50026220
Substrate
Ki
>10000±n/a nM
Comments
PDSP_3246
Citation
 Xiao, YKellar, KJ The comparative pharmacology and up-regulation of rat neuronal nicotinic receptor subtype binding sites stably expressed in transfected mammalian cells. J Pharmacol Exp Ther 310:98-107 (2004)  
Target
Name:
Neuronal acetylcholine receptor subunit alpha-3
Synonyms:
ACHA3_RAT Chrna3
Type:
Enzyme
Mol. Mass.:
56995.52
Organism:
Rattus norvegicus (Rat)
Description:
P04757
Residue:
499
  
Inhibitor
Name:
BDBM50026220
Synonyms:
2-hydroxy-N,N,N-trimethylethanaminium CHEMBL293410 N-trimethylethanolamine choline | trimethylethanolamine
Type:
Small organic molecule
Emp. Form.:
C5H14NO
Mol. Mass.:
104.1702
SMILES:
C[N+](C)(C)CCO
: