Target
P2X purinoceptor 2
Ligand
BDBM86489
Substrate
Ki
320±n/a nM
Comments
PDSP_4071
Citation
 Jarvis, MFBianchi, BUchic, JTCartmell, JLee, CHWilliams, MFaltynek, C [3H]A-317491, a novel high-affinity non-nucleotide antagonist that specifically labels human P2X2/3 and P2X3 receptors. J Pharmacol Exp Ther 310:407-16 (2004)  
Target
Name:
P2X purinoceptor 2
Synonyms:
ATP receptor P2RX2_HUMAN Purinergic receptor | PurinergicP2X2/3
Type:
Enzyme Catalytic Domain
Mol. Mass.:
51765.18
Organism:
Homo sapiens (Human)
Description:
PurinergicP2X2/3 0 HUMAN::Q9UBL9
Residue:
471
  
Inhibitor
Name:
BDBM86489
Synonyms:
AP3A NSC_3035419
Type:
Small organic molecule
Emp. Form.:
C20H27N10O16P3
Mol. Mass.:
756.4071
SMILES:
Nc1ncnc2n(cnc12)C1OC(COP(O)(=O)OP(O)(=O)OP(O)(=O)OC2C(CO)OC(C2O)n2cnc3c(N)ncnc23)C(O)C1O
: