Target
Mu-type opioid receptor
Ligand
BDBM86258
Substrate
Ki
2.5±n/a nM
Comments
PDSP_1250
Citation
 Gilbert, AKHosztafi, SMahurter, LPasternak, GW Pharmacological characterization of dihydromorphine, 6-acetyldihydromorphine and dihydroheroin analgesia and their differentiation from morphine. Eur J Pharmacol 492:123-30 (2004)  
Target
Name:
Mu-type opioid receptor
Synonyms:
MOR-1 OPIATE Mu OPRM_BOVIN
Type:
Enzyme Catalytic Domain
Mol. Mass.:
45038.37
Organism:
CALF
Description:
OPIATE Mu 2 0 CALF::P79350
Residue:
401
  
Inhibitor
Name:
BDBM86258
Synonyms:
CAS_23552-18-3 NSC_5980
Type:
Small organic molecule
Emp. Form.:
C17H19NO3
Mol. Mass.:
285.3377
SMILES:
CN1CCC23C4Oc5c2c(CC1C3C=CC4O)ccc5O
: