Target
Neuronal acetylcholine receptor subunit alpha-4
Ligand
BDBM86910
Substrate
Ki
1010±n/a nM
Comments
PDSP_8516
Citation
 Charton, YGuillonneau, CLockhart, BLestage, PGoldstein, S Preparation and affinity profile of novel nicotinic ligands. Bioorg Med Chem Lett 18:2188-93 (2008)  
Target
Name:
Neuronal acetylcholine receptor subunit alpha-4
Synonyms:
ACHA4_RAT Cholinergic, Nicotinic Alpha4Beta2 Chrna4 Neuronal acetylcholine receptor (alpha4beta2 nAChR) Neuronal acetylcholine receptor subunit alpha 4 beta 2 | Neuronal acetylcholine receptor subunit alpha-4
Type:
Enzyme
Mol. Mass.:
70196.44
Organism:
Rattus norvegicus (Rat)
Description:
P09483
Residue:
630
  
Inhibitor
Name:
BDBM86910
Synonyms:
CAS_44454126 NSC_44454126
Type:
Small organic molecule
Emp. Form.:
C11H16N2O
Mol. Mass.:
192.2575
SMILES:
CCNC1(COc2cccnc2)CC1
: