Target
DNA dC->dU-editing enzyme APOBEC-3G
Ligand
BDBM87093
Substrate
Meas. Tech.
SAR analysis of small molecule inhibitors of APOBEC3G DNA Deaminase via a fluorescence-based single-stranded DNA deaminase assay
Temperature
298.15±n/a K
IC50
>99000±n/a nM
Comments
extracted
Citation
 PubChem, PC SAR analysis of small molecule inhibitors of APOBEC3G DNA Deaminase via a fluorescence-based single-stranded DNA deaminase assay PubChem Bioassay (2011)[AID] 
Target
Name:
DNA dC->dU-editing enzyme APOBEC-3G
Synonyms:
ABC3G_HUMAN | APOBEC3G
Type:
Enzyme Catalytic Domain
Mol. Mass.:
46419.54
Organism:
Homo sapiens (Human)
Description:
gi_13399304
Residue:
384
  
Inhibitor
Name:
BDBM87093
Synonyms:
7-chloranyl-1-[(4-chlorophenyl)methylsulfanyl]-4-(2-methylpropyl)-[1,2,4]triazolo[4,3-a]quinazolin-5-one 7-chloro-1-[(4-chlorophenyl)methylsulfanyl]-4-(2-methylpropyl)-[1,2,4]triazolo[4,3-a]quinazolin-5-one MLS-0463475.0001 | cid_46298598
Type:
Small organic molecule
Emp. Form.:
C20H18Cl2N4OS
Mol. Mass.:
433.354
SMILES:
CC(C)Cn1c2nnc(SCc3ccc(Cl)cc3)n2c2ccc(Cl)cc2c1=O
: