Target
DNA dC->dU-editing enzyme APOBEC-3G
Ligand
BDBM87102
Substrate
Meas. Tech.
SAR analysis of small molecule inhibitors of APOBEC3G DNA Deaminase via a fluorescence-based single-stranded DNA deaminase assay
Temperature
298.15±n/a K
IC50
>99000±n/a nM
Comments
extracted
Citation
 PubChem, PC SAR analysis of small molecule inhibitors of APOBEC3G DNA Deaminase via a fluorescence-based single-stranded DNA deaminase assay PubChem Bioassay (2011)[AID] 
Target
Name:
DNA dC->dU-editing enzyme APOBEC-3G
Synonyms:
ABC3G_HUMAN | APOBEC3G
Type:
Enzyme Catalytic Domain
Mol. Mass.:
46419.54
Organism:
Homo sapiens (Human)
Description:
gi_13399304
Residue:
384
  
Inhibitor
Name:
BDBM87102
Synonyms:
4-[[5-(4-methoxyphenyl)-1H-1,2,4-triazol-3-yl]sulfanylmethyl]-2-thiophen-2-yl-1,3-oxazole 4-[[[5-(4-methoxyphenyl)-1H-1,2,4-triazol-3-yl]thio]methyl]-2-thiophen-2-yloxazole cid_7896504
Type:
Small organic molecule
Emp. Form.:
C17H14N4O2S2
Mol. Mass.:
370.449
SMILES:
COc1ccc(cc1)-c1nnc(SCc2coc(n2)-c2cccs2)[nH]1
: