Target
DNA dC->dU-editing enzyme APOBEC-3G
Ligand
BDBM87106
Substrate
Meas. Tech.
SAR analysis of small molecule inhibitors of APOBEC3G DNA Deaminase via a fluorescence-based single-stranded DNA deaminase assay
Temperature
298.15±n/a K
IC50
>99000±n/a nM
Comments
extracted
Citation
 PubChem, PC SAR analysis of small molecule inhibitors of APOBEC3G DNA Deaminase via a fluorescence-based single-stranded DNA deaminase assay PubChem Bioassay (2011)[AID] 
Target
Name:
DNA dC->dU-editing enzyme APOBEC-3G
Synonyms:
ABC3G_HUMAN | APOBEC3G
Type:
Enzyme Catalytic Domain
Mol. Mass.:
46419.54
Organism:
Homo sapiens (Human)
Description:
gi_13399304
Residue:
384
  
Inhibitor
Name:
BDBM87106
Synonyms:
3-(3-chloranyl-6-methoxy-1-benzothiophen-2-yl)-6,7,8,9-tetrahydro-5H-[1,2,4]triazolo[4,3-a]azepine 3-(3-chloro-6-methoxy-benzothiophen-2-yl)-6,7,8,9-tetrahydro-5H-[1,2,4]triazol[4,3-a]azepine cid_2414965
Type:
Small organic molecule
Emp. Form.:
C16H16ClN3OS
Mol. Mass.:
333.836
SMILES:
COc1ccc2c(Cl)c(sc2c1)-c1nnc2CCCCCn12
: