Target
DNA dC->dU-editing enzyme APOBEC-3G
Ligand
BDBM87116
Substrate
Meas. Tech.
SAR analysis of small molecule inhibitors of APOBEC3G DNA Deaminase via a fluorescence-based single-stranded DNA deaminase assay
Temperature
298.15±n/a K
IC50
70800±n/a nM
Comments
extracted
Citation
 PubChem, PC SAR analysis of small molecule inhibitors of APOBEC3G DNA Deaminase via a fluorescence-based single-stranded DNA deaminase assay PubChem Bioassay (2011)[AID] 
Target
Name:
DNA dC->dU-editing enzyme APOBEC-3G
Synonyms:
ABC3G_HUMAN | APOBEC3G
Type:
Enzyme Catalytic Domain
Mol. Mass.:
46419.54
Organism:
Homo sapiens (Human)
Description:
gi_13399304
Residue:
384
  
Inhibitor
Name:
BDBM87116
Synonyms:
1-methyl-5-(4-methyl-5-prop-2-enylsulfanyl-1,2,4-triazol-3-yl)-3-(trifluoromethyl)thieno[2,3-c]pyrazole 5-[5-(allylthio)-4-methyl-1,2,4-triazol-3-yl]-1-methyl-3-(trifluoromethyl)thieno[2,3-c]pyrazole cid_3716917
Type:
Small organic molecule
Emp. Form.:
C13H12F3N5S2
Mol. Mass.:
359.393
SMILES:
Cn1nc(c2cc(sc12)-c1nnc(SCC=C)n1C)C(F)(F)F
: