Target
Phospholipase D2
Ligand
BDBM87200
Substrate
Meas. Tech.
Cellular PLD2 concentration response
IC50
1600±n/a nM
Citation
 PubChem, PC Cellular PLD2 concentration response PubChem Bioassay (2011)[AID] 
Target
Name:
Phospholipase D2
Synonyms:
PLD2 Phospholipase D2 phospholipase D2 isoform PLD2A
Type:
Protein
Mol. Mass.:
106002.47
Organism:
Homo sapiens (Human)
Description:
Residue:
933
  
Inhibitor
Name:
BDBM87200
Synonyms:
3,4-bis(fluoranyl)-N-[(2S)-1-[4-(2-oxidanylidene-3H-benzimidazol-1-yl)piperidin-1-yl]propan-2-yl]benzamide;2,2,2-tris(fluoranyl)ethanoic acid 3,4-difluoro-N-[(2S)-1-[4-(2-oxo-3H-benzimidazol-1-yl)-1-piperidinyl]propan-2-yl]benzamide;2,2,2-trifluoroacetic acid VU0360246-1 | cid_53470161
Type:
Small organic molecule
Emp. Form.:
C22H24F2N4O2
Mol. Mass.:
414.4484
SMILES:
C[C@@H](CN1CCC(CC1)n1c2ccccc2[nH]c1=O)NC(=O)c1ccc(F)c(F)c1
: