Target
Phospholipase D2
Ligand
BDBM87229
Substrate
Meas. Tech.
Cellular PLD2 concentration response
IC50
3800±n/a nM
Citation
 PubChem, PC Cellular PLD2 concentration response PubChem Bioassay (2011)[AID] 
Target
Name:
Phospholipase D2
Synonyms:
PLD2 Phospholipase D2 phospholipase D2 isoform PLD2A
Type:
Protein
Mol. Mass.:
106002.47
Organism:
Homo sapiens (Human)
Description:
Residue:
933
  
Inhibitor
Name:
BDBM87229
Synonyms:
(1R,2R)-N-[(1S)-2-[4-(6-fluoro-2-keto-3H-benzimidazol-1-yl)piperidino]-1-methyl-ethyl]-2-phenyl-cyclopropanecarboxamide;2,2,2-trifluoroacetic acid (1R,2R)-N-[(2S)-1-[4-(6-fluoro-2-oxo-3H-benzimidazol-1-yl)-1-piperidinyl]propan-2-yl]-2-phenyl-1-cyclopropanecarboxamide;2,2,2-trifluoroacetic acid VU0359570-1 | cid_53470212
Type:
Small organic molecule
Emp. Form.:
C25H29FN4O2
Mol. Mass.:
436.5218
SMILES:
C[C@@H](CN1CCC(CC1)n1c2cc(F)ccc2[nH]c1=O)NC(=O)[C@@H]1C[C@H]1c1ccccc1
: