Target
Phospholipase D2
Ligand
BDBM50258083
Substrate
Meas. Tech.
Cellular PLD2 concentration response
IC50
240±n/a nM
Citation
 PubChem, PC Cellular PLD2 concentration response PubChem Bioassay (2011)[AID] 
Target
Name:
Phospholipase D2
Synonyms:
PLD2 Phospholipase D2 phospholipase D2 isoform PLD2A
Type:
Protein
Mol. Mass.:
106002.47
Organism:
Homo sapiens (Human)
Description:
Residue:
933
  
Inhibitor
Name:
BDBM50258083
Synonyms:
CHEMBL494183 cid_21429000
Type:
Small organic molecule
Emp. Form.:
C22H25ClN4O2
Mol. Mass.:
412.913
SMILES:
Cc1ccc(cc1)C(=O)NCCN1CCC(CC1)n1c2ccc(Cl)cc2[nH]c1=O
: