Target
Phospholipase D2
Ligand
BDBM50258129
Substrate
Meas. Tech.
Cellular PLD2 concentration response
IC50
61±n/a nM
Citation
 PubChem, PC Cellular PLD2 concentration response PubChem Bioassay (2011)[AID] 
Target
Name:
Phospholipase D2
Synonyms:
PLD2 Phospholipase D2 phospholipase D2 isoform PLD2A
Type:
Protein
Mol. Mass.:
106002.47
Organism:
Homo sapiens (Human)
Description:
Residue:
933
  
Inhibitor
Name:
BDBM50258129
Synonyms:
4-chloro-N-(2-(4-(5-fluoro-2-oxo-2,3-dihydro-1H-benzo[d]imidazol-1-yl)piperidin-1-yl)ethyl)benzamide cid_44573688
Type:
Small organic molecule
Emp. Form.:
C21H22ClFN4O2
Mol. Mass.:
416.876
SMILES:
Fc1ccc2n(C3CCN(CCNC(=O)c4ccc(Cl)cc4)CC3)c(=O)[nH]c2c1
: