Target
Phospholipase D2
Ligand
BDBM50258180
Substrate
Meas. Tech.
PLD2 purified enzyme concentration response
IC50
96±n/a nM
Citation
 PubChem, PC PLD2 purified enzyme concentration response PubChem Bioassay (2011)[AID] 
Target
Name:
Phospholipase D2
Synonyms:
PLD2 Phospholipase D2 phospholipase D2 isoform PLD2A
Type:
Protein
Mol. Mass.:
106002.47
Organism:
Homo sapiens (Human)
Description:
Residue:
933
  
Inhibitor
Name:
BDBM50258180
Synonyms:
4-chloro-N-(2-(4-(6-fluoro-2-oxo-2,3-dihydro-1H-benzo[d]imidazol-1-yl)piperidin-1-yl)ethyl)benzamide cid_44573727
Type:
Small organic molecule
Emp. Form.:
C21H22ClFN4O2
Mol. Mass.:
416.876
SMILES:
Fc1ccc2[nH]c(=O)n(C3CCN(CCNC(=O)c4ccc(Cl)cc4)CC3)c2c1
: