Target
Phospholipase D1
Ligand
BDBM87130
Substrate
Meas. Tech.
Cellular PLD1 concentration response
IC50
16±n/a nM
Citation
 PubChem, PC Cellular PLD1 concentration response PubChem Bioassay (2011)[AID] 
Target
Name:
Phospholipase D1
Synonyms:
Choline phosphatase 1 PLD1 Phosphatidylcholine-hydrolyzing phospholipase D1 Phospholipase D1 Phospholipase D2 (PLD2) | hPLD1
Type:
Protein
Mol. Mass.:
124219.92
Organism:
Homo sapiens (Human)
Description:
Q13393
Residue:
1074
  
Inhibitor
Name:
BDBM87130
Synonyms:
4-chloranyl-N-[(2S)-1-[4-(5-iodanyl-2-oxidanylidene-3H-benzimidazol-1-yl)piperidin-1-yl]propan-2-yl]benzamide;2,2,2-tris(fluoranyl)ethanoic acid 4-chloro-N-[(2S)-1-[4-(5-iodo-2-oxo-3H-benzimidazol-1-yl)-1-piperidinyl]propan-2-yl]benzamide;2,2,2-trifluoroacetic acid VU0409798-1 | cid_53469895
Type:
Small organic molecule
Emp. Form.:
C22H24ClIN4O2
Mol. Mass.:
538.809
SMILES:
C[C@@H](CN1CCC(CC1)n1c2ccc(I)cc2[nH]c1=O)NC(=O)c1ccc(Cl)cc1
: