Target
Phospholipase D1
Ligand
BDBM87142
Substrate
Meas. Tech.
Cellular PLD1 concentration response
IC50
335±n/a nM
Citation
 PubChem, PC Cellular PLD1 concentration response PubChem Bioassay (2011)[AID] 
Target
Name:
Phospholipase D1
Synonyms:
Choline phosphatase 1 PLD1 Phosphatidylcholine-hydrolyzing phospholipase D1 Phospholipase D1 Phospholipase D2 (PLD2) | hPLD1
Type:
Protein
Mol. Mass.:
124219.92
Organism:
Homo sapiens (Human)
Description:
Q13393
Residue:
1074
  
Inhibitor
Name:
BDBM87142
Synonyms:
CHEMBL1254081 N-[2-[1-(4-chlorophenyl)-4-oxidanylidene-1,3,8-triazaspiro[4.5]decan-8-yl]ethyl]-5-fluoranyl-1H-indole-2-carboxamide;2,2,2-tris(fluoranyl)ethanoic acid VU0405254-1 | cid_46938538
Type:
Small organic molecule
Emp. Form.:
C24H25ClFN5O2
Mol. Mass.:
469.939
SMILES:
Fc1ccc2[nH]c(cc2c1)C(=O)NCCN1CCC2(CC1)N(CNC2=O)c1ccc(Cl)cc1
: