Target
Phospholipase D1
Ligand
BDBM87180
Substrate
Meas. Tech.
Cellular PLD1 concentration response
IC50
413±n/a nM
Citation
 PubChem, PC Cellular PLD1 concentration response PubChem Bioassay (2011)[AID] 
Target
Name:
Phospholipase D1
Synonyms:
Choline phosphatase 1 PLD1 Phosphatidylcholine-hydrolyzing phospholipase D1 Phospholipase D1 Phospholipase D2 (PLD2) | hPLD1
Type:
Protein
Mol. Mass.:
124219.92
Organism:
Homo sapiens (Human)
Description:
Q13393
Residue:
1074
  
Inhibitor
Name:
BDBM87180
Synonyms:
4-fluoranyl-N-[(2R)-1-(4-oxidanylidene-1-phenyl-1,3,8-triazaspiro[4.5]decan-8-yl)propan-2-yl]benzamide;2,2,2-tris(fluoranyl)ethanoic acid 4-fluoro-N-[(2R)-1-(4-oxo-1-phenyl-1,3,8-triazaspiro[4.5]decan-8-yl)propan-2-yl]benzamide;2,2,2-trifluoroacetic acid cid_53470044
Type:
Small organic molecule
Emp. Form.:
C23H27FN4O2
Mol. Mass.:
410.4845
SMILES:
C[C@H](CN1CCC2(CC1)N(CNC2=O)c1ccccc1)NC(=O)c1ccc(F)cc1
: