Target
Phospholipase D1
Ligand
BDBM87192
Substrate
Meas. Tech.
Cellular PLD1 concentration response
IC50
1±n/a nM
Citation
 PubChem, PC Cellular PLD1 concentration response PubChem Bioassay (2011)[AID] 
Target
Name:
Phospholipase D1
Synonyms:
Choline phosphatase 1 PLD1 Phosphatidylcholine-hydrolyzing phospholipase D1 Phospholipase D1 Phospholipase D2 (PLD2) | hPLD1
Type:
Protein
Mol. Mass.:
124219.92
Organism:
Homo sapiens (Human)
Description:
Q13393
Residue:
1074
  
Inhibitor
Name:
BDBM87192
Synonyms:
N-[(1S)-2-[4-(2-keto-3H-benzimidazol-1-yl)piperidino]-1-methyl-ethyl]-1H-indole-2-carboxamide N-[(2S)-1-[4-(2-oxo-3H-benzimidazol-1-yl)-1-piperidinyl]propan-2-yl]-1H-indole-2-carboxamide VU0361537-1 | cid_53470148
Type:
Small organic molecule
Emp. Form.:
C24H27N5O2
Mol. Mass.:
417.5035
SMILES:
C[C@@H](CN1CCC(CC1)n1c2ccccc2[nH]c1=O)NC(=O)c1cc2ccccc2[nH]1
: