Target
Phospholipase D1
Ligand
BDBM50258130
Substrate
Meas. Tech.
Cellular PLD1 concentration response
IC50
12±n/a nM
Citation
 PubChem, PC Cellular PLD1 concentration response PubChem Bioassay (2011)[AID] 
Target
Name:
Phospholipase D1
Synonyms:
Choline phosphatase 1 PLD1 Phosphatidylcholine-hydrolyzing phospholipase D1 Phospholipase D1 Phospholipase D2 (PLD2) | hPLD1
Type:
Protein
Mol. Mass.:
124219.92
Organism:
Homo sapiens (Human)
Description:
Q13393
Residue:
1074
  
Inhibitor
Name:
BDBM50258130
Synonyms:
4-fluoro-N-(2-(4-(5-fluoro-2-oxo-2,3-dihydro-1H-benzo[d]imidazol-1-yl)piperidin-1-yl)ethyl)benzamide cid_44573689
Type:
Small organic molecule
Emp. Form.:
C21H22F2N4O2
Mol. Mass.:
400.4218
SMILES:
Fc1ccc(cc1)C(=O)NCCN1CCC(CC1)n1c2ccc(F)cc2[nH]c1=O
: