Target
Phospholipase D1
Ligand
BDBM50206153
Substrate
Meas. Tech.
Cellular PLD1 concentration response
IC50
8±n/a nM
Citation
 PubChem, PC Cellular PLD1 concentration response PubChem Bioassay (2011)[AID] 
Target
Name:
Phospholipase D1
Synonyms:
Choline phosphatase 1 PLD1 Phosphatidylcholine-hydrolyzing phospholipase D1 Phospholipase D1 Phospholipase D2 (PLD2) | hPLD1
Type:
Protein
Mol. Mass.:
124219.92
Organism:
Homo sapiens (Human)
Description:
Q13393
Residue:
1074
  
Inhibitor
Name:
BDBM50206153
Synonyms:
CHEMBL246032 N-(2-(4-(2-oxo-2,3-dihydrobenzo[d]imidazol-1-yl)piperidin-1-yl)ethyl)quinoline-3-carboxamide | cid_44438309
Type:
Small organic molecule
Emp. Form.:
C24H25N5O2
Mol. Mass.:
415.4876
SMILES:
O=C(NCCN1CCC(CC1)n1c2ccccc2[nH]c1=O)c1cnc2ccccc2c1
: