Target
Nuclear receptor coactivator 3
Ligand
BDBM87066
Substrate
Meas. Tech.
Luminescence-based cell-based high throughput dose response assay for inhibitors of the Steroid Receptor Coactivator 3 (SRC3; NCOA3)
IC50
>35877±n/a nM
Citation
 PubChem, PC Luminescence-based cell-based high throughput dose response assay for inhibitors of the Steroid Receptor Coactivator 3 (SRC3; NCOA3) PubChem Bioassay (2012)[AID] 
Target
Name:
Nuclear receptor coactivator 3
Synonyms:
AIB1 NCOA3 RAC3 nuclear receptor coactivator 3 isoform a
Type:
Enzyme Catalytic Domain
Mol. Mass.:
155305.29
Organism:
Homo sapiens (Human)
Description:
Q9Y6Q9
Residue:
1424
  
Inhibitor
Name:
BDBM87066
Synonyms:
2HBA 3-[(5E)-5-[(4-methoxyphenyl)methylidene]-4-oxidanylidene-2-sulfanylidene-1,3-thiazolidin-3-yl]propanoic acid 3-[(5E)-5-[(4-methoxyphenyl)methylidene]-4-oxo-2-sulfanylidene-3-thiazolidinyl]propanoic acid SMR000131843 | cid_1201125
Type:
Small organic molecule
Emp. Form.:
C14H13NO4S2
Mol. Mass.:
323.387
SMILES:
COc1ccc(\C=C2\SC(=S)N(CCC(O)=O)C2=O)cc1
: