Target
Nuclear receptor coactivator 3
Ligand
BDBM54258
Substrate
Meas. Tech.
Luminescence-based cell-based high throughput dose response assay for inhibitors of the Steroid Receptor Coactivator 3 (SRC3; NCOA3)
IC50
>35855±n/a nM
Citation
 PubChem, PC Luminescence-based cell-based high throughput dose response assay for inhibitors of the Steroid Receptor Coactivator 3 (SRC3; NCOA3) PubChem Bioassay (2012)[AID] 
Target
Name:
Nuclear receptor coactivator 3
Synonyms:
AIB1 NCOA3 RAC3 nuclear receptor coactivator 3 isoform a
Type:
Enzyme Catalytic Domain
Mol. Mass.:
155305.29
Organism:
Homo sapiens (Human)
Description:
Q9Y6Q9
Residue:
1424
  
Inhibitor
Name:
BDBM54258
Synonyms:
2-chloranyl-1-[4-[(3-methylphenyl)methyl]piperazin-1-yl]ethanone 2-chloro-1-[4-[(3-methylphenyl)methyl]-1-piperazinyl]ethanone MLS000336096 cid_2454965
Type:
Small organic molecule
Emp. Form.:
C14H19ClN2O
Mol. Mass.:
266.766
SMILES:
Cc1cccc(CN2CCN(CC2)C(=O)CCl)c1
: