Target
Nuclear receptor coactivator 3
Ligand
BDBM87303
Substrate
Meas. Tech.
Luminescence-based cell-based high throughput dose response assay for inhibitors of the Steroid Receptor Coactivator 3 (SRC3; NCOA3)
IC50
15065±n/a nM
Citation
 PubChem, PC Luminescence-based cell-based high throughput dose response assay for inhibitors of the Steroid Receptor Coactivator 3 (SRC3; NCOA3) PubChem Bioassay (2012)[AID] 
Target
Name:
Nuclear receptor coactivator 3
Synonyms:
AIB1 NCOA3 RAC3 nuclear receptor coactivator 3 isoform a
Type:
Enzyme Catalytic Domain
Mol. Mass.:
155305.29
Organism:
Homo sapiens (Human)
Description:
Q9Y6Q9
Residue:
1424
  
Inhibitor
Name:
BDBM87303
Synonyms:
MLS000709469 N-cyclopentyl-6-methyl-2-pyridin-4-yl-imidazo[1,2-a]pyridin-3-amine SMR000286836 cyclopentyl-[6-methyl-2-(4-pyridyl)imidazo[1,2-a]pyridin-3-yl]amine
Type:
Small organic molecule
Emp. Form.:
C18H20N4
Mol. Mass.:
292.3782
SMILES:
Cc1ccc2nc(c(NC3CCCC3)n2c1)-c1ccncc1
: