Target
Nuclear receptor coactivator 3
Ligand
BDBM87311
Substrate
Meas. Tech.
Luminescence-based cell-based high throughput dose response assay for inhibitors of the Steroid Receptor Coactivator 3 (SRC3; NCOA3)
IC50
>35867±n/a nM
Citation
 PubChem, PC Luminescence-based cell-based high throughput dose response assay for inhibitors of the Steroid Receptor Coactivator 3 (SRC3; NCOA3) PubChem Bioassay (2012)[AID] 
Target
Name:
Nuclear receptor coactivator 3
Synonyms:
AIB1 NCOA3 RAC3 nuclear receptor coactivator 3 isoform a
Type:
Enzyme Catalytic Domain
Mol. Mass.:
155305.29
Organism:
Homo sapiens (Human)
Description:
Q9Y6Q9
Residue:
1424
  
Inhibitor
Name:
BDBM87311
Synonyms:
MLS001004817 N-[4-[[4-(4-methylphenyl)-3-prop-2-enyl-1,3-thiazol-3-ium-2-yl]amino]phenyl]acetamide;bromide N-[4-[[4-(4-methylphenyl)-3-prop-2-enyl-2-thiazol-3-iumyl]amino]phenyl]acetamide;bromide cid_16196105
Type:
Small organic molecule
Emp. Form.:
C21H22N3OS
Mol. Mass.:
364.483
SMILES:
CC(=O)Nc1ccc(cc1)\[NH+]=c1/scc(-c2ccc(C)cc2)n1CC=C
: