Target
Nuclear receptor coactivator 3
Ligand
BDBM87328
Substrate
Meas. Tech.
Luminescence-based cell-based high throughput dose response assay for inhibitors of the Steroid Receptor Coactivator 3 (SRC3; NCOA3)
IC50
3939±n/a nM
Citation
 PubChem, PC Luminescence-based cell-based high throughput dose response assay for inhibitors of the Steroid Receptor Coactivator 3 (SRC3; NCOA3) PubChem Bioassay (2012)[AID] 
Target
Name:
Nuclear receptor coactivator 3
Synonyms:
AIB1 NCOA3 RAC3 nuclear receptor coactivator 3 isoform a
Type:
Enzyme Catalytic Domain
Mol. Mass.:
155305.29
Organism:
Homo sapiens (Human)
Description:
Q9Y6Q9
Residue:
1424
  
Inhibitor
Name:
BDBM87328
Synonyms:
1-[(E)-(6-chloranyl-2,3-dihydrothiochromen-4-ylidene)amino]thiourea MLS000861999 [(E)-(6-chloro-2,3-dihydro-1-benzothiopyran-4-ylidene)amino]thiourea [(E)-(6-chlorothiochroman-4-ylidene)amino]thiourea | cid_9580662
Type:
Small organic molecule
Emp. Form.:
C10H10ClN3S2
Mol. Mass.:
271.79
SMILES:
NC(=S)NN=C1CCSc2ccc(Cl)cc12
: