Target
Nuclear receptor coactivator 3
Ligand
BDBM87338
Substrate
Meas. Tech.
Luminescence-based cell-based high throughput dose response assay for inhibitors of the Steroid Receptor Coactivator 3 (SRC3; NCOA3)
IC50
8072±n/a nM
Citation
 PubChem, PC Luminescence-based cell-based high throughput dose response assay for inhibitors of the Steroid Receptor Coactivator 3 (SRC3; NCOA3) PubChem Bioassay (2012)[AID] 
Target
Name:
Nuclear receptor coactivator 3
Synonyms:
AIB1 NCOA3 RAC3 nuclear receptor coactivator 3 isoform a
Type:
Enzyme Catalytic Domain
Mol. Mass.:
155305.29
Organism:
Homo sapiens (Human)
Description:
Q9Y6Q9
Residue:
1424
  
Inhibitor
Name:
BDBM87338
Synonyms:
7-nitrobenzo[f]quinoline SMR000554411 | cid_759147
Type:
Small organic molecule
Emp. Form.:
C13H8N2O2
Mol. Mass.:
224.2148
SMILES:
[O-][N+](=O)c1cccc2c1ccc1ncccc21
: