Target
Nuclear receptor coactivator 3
Ligand
BDBM87347
Substrate
Meas. Tech.
Luminescence-based cell-based high throughput dose response assay for inhibitors of the Steroid Receptor Coactivator 3 (SRC3; NCOA3)
IC50
10149±n/a nM
Citation
 PubChem, PC Luminescence-based cell-based high throughput dose response assay for inhibitors of the Steroid Receptor Coactivator 3 (SRC3; NCOA3) PubChem Bioassay (2012)[AID] 
Target
Name:
Nuclear receptor coactivator 3
Synonyms:
AIB1 NCOA3 RAC3 nuclear receptor coactivator 3 isoform a
Type:
Enzyme Catalytic Domain
Mol. Mass.:
155305.29
Organism:
Homo sapiens (Human)
Description:
Q9Y6Q9
Residue:
1424
  
Inhibitor
Name:
BDBM87347
Synonyms:
2-chloranyl-N-[(E)-[phenyl(pyridin-2-yl)methylidene]amino]benzamide 2-chloro-N-[(E)-[phenyl(2-pyridinyl)methylidene]amino]benzamide 2-chloro-N-[(E)-[phenyl(pyridin-2-yl)methylidene]amino]benzamide SMR000673314 | cid_5411796
Type:
Small organic molecule
Emp. Form.:
C19H14ClN3O
Mol. Mass.:
335.787
SMILES:
Clc1ccccc1C(=O)N\N=C(/c1ccccc1)c1ccccn1
: