Target
Nuclear receptor coactivator 3
Ligand
BDBM87353
Substrate
Meas. Tech.
Luminescence-based cell-based high throughput dose response assay for inhibitors of the Steroid Receptor Coactivator 3 (SRC3; NCOA3)
IC50
7740±n/a nM
Citation
 PubChem, PC Luminescence-based cell-based high throughput dose response assay for inhibitors of the Steroid Receptor Coactivator 3 (SRC3; NCOA3) PubChem Bioassay (2012)[AID] 
Target
Name:
Nuclear receptor coactivator 3
Synonyms:
AIB1 NCOA3 RAC3 nuclear receptor coactivator 3 isoform a
Type:
Enzyme Catalytic Domain
Mol. Mass.:
155305.29
Organism:
Homo sapiens (Human)
Description:
Q9Y6Q9
Residue:
1424
  
Inhibitor
Name:
BDBM87353
Synonyms:
2-amino-3-pyridinecarboxylic acid [2-[4-(4-chlorophenyl)sulfonyl-1-piperazinyl]-2-oxoethyl] ester MLS002162308 [2-[4-(4-chlorophenyl)sulfonylpiperazin-1-yl]-2-oxidanylidene-ethyl] 2-azanylpyridine-3-carboxylate cid_4849353
Type:
Small organic molecule
Emp. Form.:
C18H19ClN4O5S
Mol. Mass.:
438.885
SMILES:
Nc1ncccc1C(=O)OCC(=O)N1CCN(CC1)S(=O)(=O)c1ccc(Cl)cc1
: