Target
Tegument protein VP16
Ligand
BDBM48212
Substrate
Meas. Tech.
Counterscreen for inhibitors of the Steroid Receptor Coactivator 3 (SRC3; NCOA3)
IC50
20162±n/a nM
Citation
 PubChem, PC Counterscreen for inhibitors of the Steroid Receptor Coactivator 3 (SRC3; NCOA3): Luminescence-based cell-based high throughput dose response assay to identify inhibitors of the Herpes Virus Virion Protein 16 (VP16) PubChem Bioassay (2012)[AID] 
Target
Name:
Tegument protein VP16
Synonyms:
Alpha trans-inducing protein (VP16) transactivating tegument protein VP16
Type:
PROTEIN
Mol. Mass.:
54325.13
Organism:
Human herpesvirus 1 (strain 17) (HHV-1) (Human herpes simplex virus1)
Description:
EBI_100271
Residue:
490
  
Inhibitor
Name:
BDBM48212
Synonyms:
3-(4-Methoxy-phenyl)-7-piperidin-1-yl-isothiazolo[4,5-d]pyrimidine 3-(4-methoxyphenyl)-7-piperidin-1-yl-[1,2]thiazolo[4,5-d]pyrimidine MLS000067913 cid_1462058
Type:
Small organic molecule
Emp. Form.:
C17H18N4OS
Mol. Mass.:
326.416
SMILES:
COc1ccc(cc1)-c1nsc2c(ncnc12)N1CCCCC1
: