Target
Tegument protein VP16
Ligand
BDBM87280
Substrate
Meas. Tech.
Counterscreen for inhibitors of the Steroid Receptor Coactivator 3 (SRC3; NCOA3)
IC50
14214±n/a nM
Citation
 PubChem, PC Counterscreen for inhibitors of the Steroid Receptor Coactivator 3 (SRC3; NCOA3): Luminescence-based cell-based high throughput dose response assay to identify inhibitors of the Herpes Virus Virion Protein 16 (VP16) PubChem Bioassay (2012)[AID] 
Target
Name:
Tegument protein VP16
Synonyms:
Alpha trans-inducing protein (VP16) transactivating tegument protein VP16
Type:
PROTEIN
Mol. Mass.:
54325.13
Organism:
Human herpesvirus 1 (strain 17) (HHV-1) (Human herpes simplex virus1)
Description:
EBI_100271
Residue:
490
  
Inhibitor
Name:
BDBM87280
Synonyms:
3-(2-Methyl-3-propyl-quinolin-4-ylsulfanyl)-propionitrile 3-(2-methyl-3-propylquinolin-4-yl)sulfanylpropanenitrile 3-[(2-methyl-3-propyl-4-quinolyl)thio]propionitrile SMR000218763 | cid_1948928
Type:
Small organic molecule
Emp. Form.:
C16H18N2S
Mol. Mass.:
270.393
SMILES:
CCCc1c(C)nc2ccccc2c1SCCC#N
: