Target
Tegument protein VP16
Ligand
BDBM87288
Substrate
Meas. Tech.
Counterscreen for inhibitors of the Steroid Receptor Coactivator 3 (SRC3; NCOA3)
IC50
>35863±n/a nM
Citation
 PubChem, PC Counterscreen for inhibitors of the Steroid Receptor Coactivator 3 (SRC3; NCOA3): Luminescence-based cell-based high throughput dose response assay to identify inhibitors of the Herpes Virus Virion Protein 16 (VP16) PubChem Bioassay (2012)[AID] 
Target
Name:
Tegument protein VP16
Synonyms:
Alpha trans-inducing protein (VP16) transactivating tegument protein VP16
Type:
PROTEIN
Mol. Mass.:
54325.13
Organism:
Human herpesvirus 1 (strain 17) (HHV-1) (Human herpes simplex virus1)
Description:
EBI_100271
Residue:
490
  
Inhibitor
Name:
BDBM87288
Synonyms:
MLS000389065 N-[4-[2-(2,5-dimethyl-1-phenylpyrrol-3-yl)-2-oxoethyl]sulfanylphenyl]acetamide N-[4-[[2-(2,5-dimethyl-1-phenyl-pyrrol-3-yl)-2-keto-ethyl]thio]phenyl]acetamide cid_2086773
Type:
Small organic molecule
Emp. Form.:
C22H22N2O2S
Mol. Mass.:
378.487
SMILES:
CC(=O)Nc1ccc(SCC(=O)c2cc(C)n(c2C)-c2ccccc2)cc1
: