Target
Tegument protein VP16
Ligand
BDBM64363
Substrate
Meas. Tech.
Counterscreen for inhibitors of the Steroid Receptor Coactivator 3 (SRC3; NCOA3)
IC50
32465±n/a nM
Citation
 PubChem, PC Counterscreen for inhibitors of the Steroid Receptor Coactivator 3 (SRC3; NCOA3): Luminescence-based cell-based high throughput dose response assay to identify inhibitors of the Herpes Virus Virion Protein 16 (VP16) PubChem Bioassay (2012)[AID] 
Target
Name:
Tegument protein VP16
Synonyms:
Alpha trans-inducing protein (VP16) transactivating tegument protein VP16
Type:
PROTEIN
Mol. Mass.:
54325.13
Organism:
Human herpesvirus 1 (strain 17) (HHV-1) (Human herpes simplex virus1)
Description:
EBI_100271
Residue:
490
  
Inhibitor
Name:
BDBM64363
Synonyms:
4-[3-(2-chlorophenyl)-1,2,4-oxadiazol-5-yl]-N-cyclopentyl-butanamide 4-[3-(2-chlorophenyl)-1,2,4-oxadiazol-5-yl]-N-cyclopentylbutanamide SMR000625664 | cid_23605826
Type:
Small organic molecule
Emp. Form.:
C17H20ClN3O2
Mol. Mass.:
333.813
SMILES:
Clc1ccccc1-c1noc(CCCC(=O)NC2CCCC2)n1
: