Target
Tegument protein VP16
Ligand
BDBM87352
Substrate
Meas. Tech.
Counterscreen for inhibitors of the Steroid Receptor Coactivator 3 (SRC3; NCOA3)
IC50
15105±n/a nM
Citation
 PubChem, PC Counterscreen for inhibitors of the Steroid Receptor Coactivator 3 (SRC3; NCOA3): Luminescence-based cell-based high throughput dose response assay to identify inhibitors of the Herpes Virus Virion Protein 16 (VP16) PubChem Bioassay (2012)[AID] 
Target
Name:
Tegument protein VP16
Synonyms:
Alpha trans-inducing protein (VP16) transactivating tegument protein VP16
Type:
PROTEIN
Mol. Mass.:
54325.13
Organism:
Human herpesvirus 1 (strain 17) (HHV-1) (Human herpes simplex virus1)
Description:
EBI_100271
Residue:
490
  
Inhibitor
Name:
BDBM87352
Synonyms:
2-[2-(1-isopropyl-2,5-dimethyl-pyrrol-3-yl)-2-keto-ethyl]-1,1-diketo-1,2-benzothiazol-3-one 2-[2-(2,5-dimethyl-1-propan-2-yl-pyrrol-3-yl)-2-oxidanylidene-ethyl]-1,1-bis(oxidanylidene)-1,2-benzothiazol-3-one MLS002162900 cid_8271970
Type:
Small organic molecule
Emp. Form.:
C18H20N2O4S
Mol. Mass.:
360.427
SMILES:
CC(C)n1c(C)cc(C(=O)CN2C(=O)c3ccccc3S2(=O)=O)c1C
: