Target
Nuclear receptor coactivator 1
Ligand
BDBM46455
Substrate
Meas. Tech.
Counterscreen for inhibitors of the Steroid Receptor Coactivator 3 (SRC3; NCOA3)
IC50
14960±n/a nM
Citation
 PubChem, PC Counterscreen for inhibitors of the Steroid Receptor Coactivator 3 (SRC3; NCOA3): Luminescence-based cell-based high throughput dose response assay to identify inhibitors of the Steroid Receptor Coactivator 1 (SRC1; NCOA1) PubChem Bioassay (2012)[AID] 
Target
Name:
Nuclear receptor coactivator 1
Synonyms:
BHLHE74 NCOA1 NCoA-1 Protein Hin-2 Renal carcinoma antigen NY-REN-52 SRC1 nuclear receptor coactivator 1 isoform 1
Type:
PROTEIN
Mol. Mass.:
156749.34
Organism:
Homo sapiens (Human)
Description:
ChEMBL_759690
Residue:
1441
  
Inhibitor
Name:
BDBM46455
Synonyms:
3-bromanyl-5-ethoxy-4-methoxy-benzamide 3-bromo-5-ethoxy-4-methoxybenzamide SMR000114541 | cid_900806
Type:
Small organic molecule
Emp. Form.:
C10H12BrNO3
Mol. Mass.:
274.111
SMILES:
CCOc1cc(cc(Br)c1OC)C(N)=O
: