Target
Nuclear receptor coactivator 1
Ligand
BDBM87268
Substrate
Meas. Tech.
Counterscreen for inhibitors of the Steroid Receptor Coactivator 3 (SRC3; NCOA3)
IC50
>35871±n/a nM
Citation
 PubChem, PC Counterscreen for inhibitors of the Steroid Receptor Coactivator 3 (SRC3; NCOA3): Luminescence-based cell-based high throughput dose response assay to identify inhibitors of the Steroid Receptor Coactivator 1 (SRC1; NCOA1) PubChem Bioassay (2012)[AID] 
Target
Name:
Nuclear receptor coactivator 1
Synonyms:
BHLHE74 NCOA1 NCoA-1 Protein Hin-2 Renal carcinoma antigen NY-REN-52 SRC1 nuclear receptor coactivator 1 isoform 1
Type:
PROTEIN
Mol. Mass.:
156749.34
Organism:
Homo sapiens (Human)
Description:
ChEMBL_759690
Residue:
1441
  
Inhibitor
Name:
BDBM87268
Synonyms:
2-(4-methylsulfonyl-2-nitro-phenyl)sulfanyl-1,3-benzothiazole 2-[(4-mesyl-2-nitro-phenyl)thio]-1,3-benzothiazole 2-{[4-(methylsulfonyl)-2-nitrophenyl]thio}-1,3-benzothiazole SMR000194783 | cid_1580704
Type:
Small organic molecule
Emp. Form.:
C14H10N2O4S3
Mol. Mass.:
366.435
SMILES:
CS(=O)(=O)c1ccc(Sc2nc3ccccc3s2)c(c1)[N+]([O-])=O
: