Target
Nuclear receptor coactivator 1
Ligand
BDBM41953
Substrate
Meas. Tech.
Counterscreen for inhibitors of the Steroid Receptor Coactivator 3 (SRC3; NCOA3)
IC50
4519±n/a nM
Citation
 PubChem, PC Counterscreen for inhibitors of the Steroid Receptor Coactivator 3 (SRC3; NCOA3): Luminescence-based cell-based high throughput dose response assay to identify inhibitors of the Steroid Receptor Coactivator 1 (SRC1; NCOA1) PubChem Bioassay (2012)[AID] 
Target
Name:
Nuclear receptor coactivator 1
Synonyms:
BHLHE74 NCOA1 NCoA-1 Protein Hin-2 Renal carcinoma antigen NY-REN-52 SRC1 nuclear receptor coactivator 1 isoform 1
Type:
PROTEIN
Mol. Mass.:
156749.34
Organism:
Homo sapiens (Human)
Description:
ChEMBL_759690
Residue:
1441
  
Inhibitor
Name:
BDBM41953
Synonyms:
4-(3,5-dimethylpiperidin-1-yl)sulfonyl-N'-(4-methyl-1,3-benzothiazol-2-yl)benzohydrazide 4-[(3,5-dimethyl-1-piperidinyl)sulfonyl]-N'-(4-methyl-1,3-benzothiazol-2-yl)benzohydrazide SMR000235764 | cid_12006167
Type:
Small organic molecule
Emp. Form.:
C22H26N4O3S2
Mol. Mass.:
458.597
SMILES:
CC1CC(C)CN(C1)S(=O)(=O)c1ccc(cc1)C(=O)NNc1nc2c(C)cccc2s1
: