Target
Nuclear receptor coactivator 1
Ligand
BDBM87282
Substrate
Meas. Tech.
Counterscreen for inhibitors of the Steroid Receptor Coactivator 3 (SRC3; NCOA3)
IC50
11136±n/a nM
Citation
 PubChem, PC Counterscreen for inhibitors of the Steroid Receptor Coactivator 3 (SRC3; NCOA3): Luminescence-based cell-based high throughput dose response assay to identify inhibitors of the Steroid Receptor Coactivator 1 (SRC1; NCOA1) PubChem Bioassay (2012)[AID] 
Target
Name:
Nuclear receptor coactivator 1
Synonyms:
BHLHE74 NCOA1 NCoA-1 Protein Hin-2 Renal carcinoma antigen NY-REN-52 SRC1 nuclear receptor coactivator 1 isoform 1
Type:
PROTEIN
Mol. Mass.:
156749.34
Organism:
Homo sapiens (Human)
Description:
ChEMBL_759690
Residue:
1441
  
Inhibitor
Name:
BDBM87282
Synonyms:
5-bromanyl-N-[4-(2-morpholin-4-yl-2-oxidanylidene-ethoxy)phenyl]pyridine-3-carboxamide 5-bromo-N-[4-(2-morpholin-4-yl-2-oxoethoxy)phenyl]pyridine-3-carboxamide 5-bromo-N-{4-[2-(4-morpholinyl)-2-oxoethoxy]phenyl}nicotinamide SMR000229370 | cid_990978
Type:
Small organic molecule
Emp. Form.:
C18H18BrN3O4
Mol. Mass.:
420.257
SMILES:
Brc1cncc(c1)C(=O)Nc1ccc(OCC(=O)N2CCOCC2)cc1
: