Target
Nuclear receptor coactivator 1
Ligand
BDBM87296
Substrate
Meas. Tech.
Counterscreen for inhibitors of the Steroid Receptor Coactivator 3 (SRC3; NCOA3)
IC50
>35869±n/a nM
Citation
 PubChem, PC Counterscreen for inhibitors of the Steroid Receptor Coactivator 3 (SRC3; NCOA3): Luminescence-based cell-based high throughput dose response assay to identify inhibitors of the Steroid Receptor Coactivator 1 (SRC1; NCOA1) PubChem Bioassay (2012)[AID] 
Target
Name:
Nuclear receptor coactivator 1
Synonyms:
BHLHE74 NCOA1 NCoA-1 Protein Hin-2 Renal carcinoma antigen NY-REN-52 SRC1 nuclear receptor coactivator 1 isoform 1
Type:
PROTEIN
Mol. Mass.:
156749.34
Organism:
Homo sapiens (Human)
Description:
ChEMBL_759690
Residue:
1441
  
Inhibitor
Name:
BDBM87296
Synonyms:
2-(3-nitroanilino)-N-[(E)-(5-nitro-2-furanyl)methylideneamino]acetamide 2-(3-nitroanilino)-N-[(E)-(5-nitrofuran-2-yl)methylideneamino]acetamide MLS000702290 SMR000224514 | cid_6872741
Type:
Small organic molecule
Emp. Form.:
C13H11N5O6
Mol. Mass.:
333.2563
SMILES:
[O-][N+](=O)c1ccc(\C=N\NC(=O)CNc2cccc(c2)[N+]([O-])=O)o1
: