Target
Nuclear receptor coactivator 1
Ligand
BDBM87299
Substrate
Meas. Tech.
Counterscreen for inhibitors of the Steroid Receptor Coactivator 3 (SRC3; NCOA3)
IC50
>35879±n/a nM
Citation
 PubChem, PC Counterscreen for inhibitors of the Steroid Receptor Coactivator 3 (SRC3; NCOA3): Luminescence-based cell-based high throughput dose response assay to identify inhibitors of the Steroid Receptor Coactivator 1 (SRC1; NCOA1) PubChem Bioassay (2012)[AID] 
Target
Name:
Nuclear receptor coactivator 1
Synonyms:
BHLHE74 NCOA1 NCoA-1 Protein Hin-2 Renal carcinoma antigen NY-REN-52 SRC1 nuclear receptor coactivator 1 isoform 1
Type:
PROTEIN
Mol. Mass.:
156749.34
Organism:
Homo sapiens (Human)
Description:
ChEMBL_759690
Residue:
1441
  
Inhibitor
Name:
BDBM87299
Synonyms:
MLS000703938 N-(2,3-dihydro-1,4-benzodioxin-6-yl)-2-[4-[2-(2,3-dihydro-1,4-benzodioxin-6-ylamino)-2-oxidanylidene-ethyl]-1,1-bis(oxidanylidene)thiolan-3-yl]ethanamide N-(2,3-dihydro-1,4-benzodioxin-6-yl)-2-[4-[2-(2,3-dihydro-1,4-benzodioxin-6-ylamino)-2-oxoethyl]-1,1-dioxothiolan-3-yl]acetamide SMR000225242 | cid_5045424
Type:
Small organic molecule
Emp. Form.:
C24H26N2O8S
Mol. Mass.:
502.537
SMILES:
O=C(CC1CS(=O)(=O)CC1CC(=O)Nc1ccc2OCCOc2c1)Nc1ccc2OCCOc2c1
: