Target
Nuclear receptor coactivator 1
Ligand
BDBM87301
Substrate
Meas. Tech.
Counterscreen for inhibitors of the Steroid Receptor Coactivator 3 (SRC3; NCOA3)
IC50
>35892±n/a nM
Citation
 PubChem, PC Counterscreen for inhibitors of the Steroid Receptor Coactivator 3 (SRC3; NCOA3): Luminescence-based cell-based high throughput dose response assay to identify inhibitors of the Steroid Receptor Coactivator 1 (SRC1; NCOA1) PubChem Bioassay (2012)[AID] 
Target
Name:
Nuclear receptor coactivator 1
Synonyms:
BHLHE74 NCOA1 NCoA-1 Protein Hin-2 Renal carcinoma antigen NY-REN-52 SRC1 nuclear receptor coactivator 1 isoform 1
Type:
PROTEIN
Mol. Mass.:
156749.34
Organism:
Homo sapiens (Human)
Description:
ChEMBL_759690
Residue:
1441
  
Inhibitor
Name:
BDBM87301
Synonyms:
2-({[(3-chloro-2-methylphenyl)amino]carbonyl}amino)benzamide 2-[(3-chloro-2-methyl-phenyl)carbamoylamino]benzamide 2-[[(3-chloro-2-methylanilino)-oxomethyl]amino]benzamide SMR000297831 | cid_6470404
Type:
Small organic molecule
Emp. Form.:
C15H14ClN3O2
Mol. Mass.:
303.744
SMILES:
Cc1c(Cl)cccc1NC(=O)Nc1ccccc1C(N)=O
: