Target
Nuclear receptor coactivator 1
Ligand
BDBM63551
Substrate
Meas. Tech.
Counterscreen for inhibitors of the Steroid Receptor Coactivator 3 (SRC3; NCOA3)
IC50
>35861±n/a nM
Citation
 PubChem, PC Counterscreen for inhibitors of the Steroid Receptor Coactivator 3 (SRC3; NCOA3): Luminescence-based cell-based high throughput dose response assay to identify inhibitors of the Steroid Receptor Coactivator 1 (SRC1; NCOA1) PubChem Bioassay (2012)[AID] 
Target
Name:
Nuclear receptor coactivator 1
Synonyms:
BHLHE74 NCOA1 NCoA-1 Protein Hin-2 Renal carcinoma antigen NY-REN-52 SRC1 nuclear receptor coactivator 1 isoform 1
Type:
PROTEIN
Mol. Mass.:
156749.34
Organism:
Homo sapiens (Human)
Description:
ChEMBL_759690
Residue:
1441
  
Inhibitor
Name:
BDBM63551
Synonyms:
2-(1-butyl-4-pyridinylidene)indene-1,3-dione 2-(1-butylpyridin-4-ylidene)indene-1,3-dione SMR000289924 | cid_1915589
Type:
Small organic molecule
Emp. Form.:
C18H17NO2
Mol. Mass.:
279.3331
SMILES:
[#6]-[#6]-[#6]-[#6]-[#7]-1-[#6]=[#6]\[#6](-[#6]=[#6]-1)=[#6]-1/[#6](=O)-c2ccccc2-[#6]-1=O
: