Target
Nuclear receptor coactivator 1
Ligand
BDBM87340
Substrate
Meas. Tech.
Counterscreen for inhibitors of the Steroid Receptor Coactivator 3 (SRC3; NCOA3)
IC50
20177±n/a nM
Citation
 PubChem, PC Counterscreen for inhibitors of the Steroid Receptor Coactivator 3 (SRC3; NCOA3): Luminescence-based cell-based high throughput dose response assay to identify inhibitors of the Steroid Receptor Coactivator 1 (SRC1; NCOA1) PubChem Bioassay (2012)[AID] 
Target
Name:
Nuclear receptor coactivator 1
Synonyms:
BHLHE74 NCOA1 NCoA-1 Protein Hin-2 Renal carcinoma antigen NY-REN-52 SRC1 nuclear receptor coactivator 1 isoform 1
Type:
PROTEIN
Mol. Mass.:
156749.34
Organism:
Homo sapiens (Human)
Description:
ChEMBL_759690
Residue:
1441
  
Inhibitor
Name:
BDBM87340
Synonyms:
4-(2-cyclopropyl-1,3-oxazol-5-yl)-N-(2,6-dimethylphenyl)benzenesulfonamide 4-(2-cyclopropyloxazol-5-yl)-N-(2,6-dimethylphenyl)benzenesulfonamide SMR000631511 | cid_20959061
Type:
Small organic molecule
Emp. Form.:
C20H20N2O3S
Mol. Mass.:
368.449
SMILES:
Cc1cccc(C)c1NS(=O)(=O)c1ccc(cc1)-c1cnc(o1)C1CC1
: