Target
Nuclear receptor coactivator 1
Ligand
BDBM87349
Substrate
Meas. Tech.
Counterscreen for inhibitors of the Steroid Receptor Coactivator 3 (SRC3; NCOA3)
IC50
7154±n/a nM
Citation
 PubChem, PC Counterscreen for inhibitors of the Steroid Receptor Coactivator 3 (SRC3; NCOA3): Luminescence-based cell-based high throughput dose response assay to identify inhibitors of the Steroid Receptor Coactivator 1 (SRC1; NCOA1) PubChem Bioassay (2012)[AID] 
Target
Name:
Nuclear receptor coactivator 1
Synonyms:
BHLHE74 NCOA1 NCoA-1 Protein Hin-2 Renal carcinoma antigen NY-REN-52 SRC1 nuclear receptor coactivator 1 isoform 1
Type:
PROTEIN
Mol. Mass.:
156749.34
Organism:
Homo sapiens (Human)
Description:
ChEMBL_759690
Residue:
1441
  
Inhibitor
Name:
BDBM87349
Synonyms:
MLS001159504 N-(2-tert-butylphenyl)-1-(5,6-dimethylthieno[2,3-d]pyrimidin-4-yl)isonipecotamide SMR000709301 | cid_18279608
Type:
Small organic molecule
Emp. Form.:
C24H30N4OS
Mol. Mass.:
422.586
SMILES:
Cc1sc2ncnc(N3CCC(CC3)C(=O)Nc3ccccc3C(C)(C)C)c2c1C
: